Information card for entry 7056840
Common name | <i>N</i>'-[(<i>E</i>)-(2-methoxyphenyl)methylidene]benzenesulfonohydrazide |
Chemical name | <i>N</i>'-[(<i>E</i>)-(2-methoxyphenyl)methylidene]benzenesulfonohydrazide |
Formula | C14 H14 N2 O3 S |
Calculated formula | C14 H14 N2 O3 S |
SMILES | S(=O)(=O)(N/N=C/c1c(OC)cccc1)c1ccccc1 |
Title of publication | Fabrication of a Ga3+ sensor probe based on methoxybenzylidenebenzenesulfonohydrazide (MBBSH) by an electrochemical approach |
Authors of publication | Hussain, Mohammad Musarraf; Asiri, Abdullah M.; Arshad, Muhammad Nadeem; Rahman, Mohammed M. |
Journal of publication | New Journal of Chemistry |
Year of publication | 2018 |
Journal volume | 42 |
Journal issue | 2 |
Pages of publication | 1169 |
a | 8.8094 ± 0.0005 Å |
b | 11.2917 ± 0.0008 Å |
c | 14.9528 ± 0.0009 Å |
α | 73.214 ± 0.005° |
β | 85.325 ± 0.004° |
γ | 83.268 ± 0.005° |
Cell volume | 1412.43 ± 0.16 Å3 |
Cell temperature | 296 ± 2 K |
Ambient diffraction temperature | 296 ± 2 K |
Number of distinct elements | 5 |
Space group number | 2 |
Hermann-Mauguin space group symbol | P -1 |
Hall space group symbol | -P 1 |
Residual factor for all reflections | 0.0529 |
Residual factor for significantly intense reflections | 0.041 |
Weighted residual factors for significantly intense reflections | 0.1098 |
Weighted residual factors for all reflections included in the refinement | 0.1222 |
Goodness-of-fit parameter for all reflections included in the refinement | 0.963 |
Diffraction radiation wavelength | 0.71073 Å |
Diffraction radiation type | MoKα |