Information card for entry 7056874
Formula | C37 H35 N2 Nd O11 |
Calculated formula | C37 H29 N2 Nd O8 |
Title of publication | Syntheses, structures, luminescence and magnetic properties of seven isomorphous metal‒organic frameworks based on 2,7-bis(4-benzoic acid)-N-(4-benzoic acid)carbazole |
Authors of publication | Chen, Dong-Hui; Lin, Ling; Sheng, Tian-Lu; Wen, Yue-Hong; Zhu, Xiao-Quan; Zhang, Lin-Tao; Hu, Sheng-Min; Fu, Rui-Biao; Wu, Xin-Tao |
Journal of publication | New Journal of Chemistry |
Year of publication | 2018 |
Journal volume | 42 |
Journal issue | 4 |
Pages of publication | 2830 |
a | 15.986 ± 0.007 Å |
b | 8.403 ± 0.003 Å |
c | 28.487 ± 0.013 Å |
α | 90° |
β | 96.253 ± 0.005° |
γ | 90° |
Cell volume | 3804 ± 3 Å3 |
Cell temperature | 293 ± 2 K |
Ambient diffraction temperature | 293 ± 2 K |
Number of distinct elements | 5 |
Space group number | 14 |
Hermann-Mauguin space group symbol | P 1 21/c 1 |
Hall space group symbol | -P 2ybc |
Residual factor for all reflections | 0.1089 |
Residual factor for significantly intense reflections | 0.0879 |
Weighted residual factors for significantly intense reflections | 0.1979 |
Weighted residual factors for all reflections included in the refinement | 0.2108 |
Goodness-of-fit parameter for all reflections included in the refinement | 1.169 |
Diffraction radiation wavelength | 0.71073 Å |
Diffraction radiation type | MoKα |