Information card for entry 7056877
Formula | C37 H33 Eu N2 O10 |
Calculated formula | C37 H29 Eu N2 O8 |
Title of publication | Syntheses, structures, luminescence and magnetic properties of seven isomorphous metal‒organic frameworks based on 2,7-bis(4-benzoic acid)-N-(4-benzoic acid)carbazole |
Authors of publication | Chen, Dong-Hui; Lin, Ling; Sheng, Tian-Lu; Wen, Yue-Hong; Zhu, Xiao-Quan; Zhang, Lin-Tao; Hu, Sheng-Min; Fu, Rui-Biao; Wu, Xin-Tao |
Journal of publication | New Journal of Chemistry |
Year of publication | 2018 |
Journal volume | 42 |
Journal issue | 4 |
Pages of publication | 2830 |
a | 15.776 ± 0.003 Å |
b | 8.3587 ± 0.0016 Å |
c | 28.529 ± 0.005 Å |
α | 90° |
β | 96.501 ± 0.004° |
γ | 90° |
Cell volume | 3737.8 ± 1.2 Å3 |
Cell temperature | 293 ± 2 K |
Ambient diffraction temperature | 293 ± 2 K |
Number of distinct elements | 5 |
Space group number | 14 |
Hermann-Mauguin space group symbol | P 1 21/c 1 |
Hall space group symbol | -P 2ybc |
Residual factor for all reflections | 0.0645 |
Residual factor for significantly intense reflections | 0.053 |
Weighted residual factors for significantly intense reflections | 0.1253 |
Weighted residual factors for all reflections included in the refinement | 0.1325 |
Goodness-of-fit parameter for all reflections included in the refinement | 1.108 |
Diffraction radiation wavelength | 0.71073 Å |
Diffraction radiation type | MoKα |