Information card for entry 7056884
Formula | C30 H30 Ag N7 O5 |
Calculated formula | C30 H30 Ag N7 O5 |
Title of publication | Silver(i) complexes with 2-acetylpyridinebenzoylhydrazones exhibit antimicrobial effects against yeast and filamentous fungi |
Authors of publication | Santos, Ane F.; Ferreira, Isabella P.; Takahashi, Jacqueline A.; Rodrigues, Gabriel L. S.; Pinheiro, Carlos B.; Teixeira, Letícia R.; Rocha, Willian R.; Beraldo, Heloisa |
Journal of publication | New Journal of Chemistry |
Year of publication | 2018 |
Journal volume | 42 |
Journal issue | 3 |
Pages of publication | 2125 |
a | 8.4416 ± 0.0006 Å |
b | 12.9864 ± 0.0005 Å |
c | 14.7636 ± 0.0006 Å |
α | 112.115 ± 0.004° |
β | 99.194 ± 0.004° |
γ | 95.337 ± 0.004° |
Cell volume | 1459.23 ± 0.14 Å3 |
Cell temperature | 270 ± 2 K |
Ambient diffraction temperature | 270 ± 2 K |
Number of distinct elements | 5 |
Space group number | 2 |
Hermann-Mauguin space group symbol | P -1 |
Hall space group symbol | -P 1 |
Residual factor for all reflections | 0.0409 |
Residual factor for significantly intense reflections | 0.0293 |
Weighted residual factors for significantly intense reflections | 0.0655 |
Weighted residual factors for all reflections included in the refinement | 0.0708 |
Goodness-of-fit parameter for all reflections included in the refinement | 1.032 |
Diffraction radiation wavelength | 0.71073 Å |
Diffraction radiation type | MoKα |