Information card for entry 7056924
Formula | C6 H11 N3 O3 |
Calculated formula | C6 H11 N3 O3 |
Title of publication | A uniquely fabricated Cu(ii)-metallacycle as a reusable highly sensitive dual-channel and practically functional metalloreceptor for Fe3+ and Ca2+ ions: an inorganic site of cation detection |
Authors of publication | Thakur, Neha; Pandey, Mrituanjay D.; Pandey, Rampal |
Journal of publication | New Journal of Chemistry |
Year of publication | 2018 |
Journal volume | 42 |
Journal issue | 5 |
Pages of publication | 3582 |
a | 8.442 ± 0.004 Å |
b | 6.727 ± 0.0013 Å |
c | 14.467 ± 0.003 Å |
α | 90° |
β | 90° |
γ | 90° |
Cell volume | 821.6 ± 0.5 Å3 |
Cell temperature | 277 ± 2 K |
Ambient diffraction temperature | 277 ± 2 K |
Number of distinct elements | 4 |
Space group number | 62 |
Hermann-Mauguin space group symbol | P n m a |
Hall space group symbol | -P 2ac 2n |
Residual factor for all reflections | 0.1679 |
Residual factor for significantly intense reflections | 0.1516 |
Weighted residual factors for significantly intense reflections | 0.4348 |
Weighted residual factors for all reflections included in the refinement | 0.4455 |
Goodness-of-fit parameter for all reflections included in the refinement | 1.776 |
Diffraction radiation wavelength | 0.71073 Å |
Diffraction radiation type | MoKα |