Information card for entry 7056964
Formula | C38 H29.75 Cl Cu N6 O6.36 |
Calculated formula | C38 H29.754 Cl0.996 Cu N6 O6.361 |
Title of publication | Varying structural motifs, unusual X-band electron paramagnetic spectra, DFT studies and superoxide dismutase enzymatic activity of copper(ii) complexes with N′-[(E)-phenyl(pyridin-2-yl)methylidene]benzohydrazide |
Authors of publication | Patel, Ram N.; Singh, Yogendra; Singh, Yogendra Pratap; Patel, Abhay K.; Patel, Neetu; Singh, Rita; Butcher, Raymond J.; Jasinski, Jerry P.; Colacio, Enrique; Palacios, Maria A. |
Journal of publication | New Journal of Chemistry |
Year of publication | 2018 |
Journal volume | 42 |
Journal issue | 4 |
Pages of publication | 3112 |
a | 10.79 ± 0.002 Å |
b | 19.988 ± 0.004 Å |
c | 16.376 ± 0.003 Å |
α | 90° |
β | 95.718 ± 0.003° |
γ | 90° |
Cell volume | 3514.2 ± 1.2 Å3 |
Cell temperature | 100 ± 2 K |
Ambient diffraction temperature | 100 ± 2 K |
Number of distinct elements | 6 |
Space group number | 14 |
Hermann-Mauguin space group symbol | P 1 21/c 1 |
Hall space group symbol | -P 2ybc |
Residual factor for all reflections | 0.0494 |
Residual factor for significantly intense reflections | 0.0398 |
Weighted residual factors for significantly intense reflections | 0.1047 |
Weighted residual factors for all reflections included in the refinement | 0.1093 |
Goodness-of-fit parameter for all reflections included in the refinement | 1.03 |
Diffraction radiation wavelength | 0.71073 Å |
Diffraction radiation type | MoKα |