Information card for entry 7056979
Formula | C52 H54 Au2 F12 N12 O P2 |
Calculated formula | C52 H54 Au2 F12 N12 O P2 |
Title of publication | Synthesis and characterization of Ag(i) and Au(i) complexes with macrocyclic hybrid amine N-heterocyclic carbene ligands |
Authors of publication | Lu, Taotao; Yang, Chu-Fan; Steren, Carlos A.; Fei, Fan; Chen, Xue-Tai; Xue, Zi-Ling |
Journal of publication | New Journal of Chemistry |
Year of publication | 2018 |
Journal volume | 42 |
Journal issue | 6 |
Pages of publication | 4700 |
a | 10.4271 ± 0.0008 Å |
b | 10.9326 ± 0.001 Å |
c | 12.6606 ± 0.001 Å |
α | 82.471 ± 0.003° |
β | 87.024 ± 0.002° |
γ | 89.204 ± 0.003° |
Cell volume | 1428.8 ± 0.2 Å3 |
Cell temperature | 123 ± 2 K |
Ambient diffraction temperature | 123 ± 2 K |
Number of distinct elements | 7 |
Space group number | 2 |
Hermann-Mauguin space group symbol | P -1 |
Hall space group symbol | -P 1 |
Residual factor for all reflections | 0.0905 |
Residual factor for significantly intense reflections | 0.0603 |
Weighted residual factors for significantly intense reflections | 0.1414 |
Weighted residual factors for all reflections included in the refinement | 0.1538 |
Goodness-of-fit parameter for all reflections included in the refinement | 1.065 |
Diffraction radiation wavelength | 0.71073 Å |
Diffraction radiation type | MoKα |