Information card for entry 7056986
Formula | C54 H54 Ag3 F18 N14 P3 |
Calculated formula | C54 H54 Ag3 F18 N14 P3 |
Title of publication | Synthesis and characterization of Ag(i) and Au(i) complexes with macrocyclic hybrid amine N-heterocyclic carbene ligands |
Authors of publication | Lu, Taotao; Yang, Chu-Fan; Steren, Carlos A.; Fei, Fan; Chen, Xue-Tai; Xue, Zi-Ling |
Journal of publication | New Journal of Chemistry |
Year of publication | 2018 |
Journal volume | 42 |
Journal issue | 6 |
Pages of publication | 4700 |
a | 19.8816 ± 0.0015 Å |
b | 19.6411 ± 0.0015 Å |
c | 17.4125 ± 0.0013 Å |
α | 90° |
β | 111.78 ± 0.002° |
γ | 90° |
Cell volume | 6314.1 ± 0.8 Å3 |
Cell temperature | 150 ± 2 K |
Ambient diffraction temperature | 150 ± 2 K |
Number of distinct elements | 6 |
Space group number | 15 |
Hermann-Mauguin space group symbol | C 1 2/c 1 |
Hall space group symbol | -C 2yc |
Residual factor for all reflections | 0.0877 |
Residual factor for significantly intense reflections | 0.0594 |
Weighted residual factors for significantly intense reflections | 0.1423 |
Weighted residual factors for all reflections included in the refinement | 0.1535 |
Goodness-of-fit parameter for all reflections included in the refinement | 1.055 |
Diffraction radiation wavelength | 0.71073 Å |
Diffraction radiation type | MoKα |