Information card for entry 7057012
Formula |
C50 H40 F12 N4 P2 |
Calculated formula |
C50 H40 F12 N4 P2 |
Title of publication |
A chemically-responsive bis-acridinium receptor |
Authors of publication |
Gosset, A.; Xu, Z.; Maurel, F.; Chamoreau, L.-M.; Nowak, S.; Vives, G.; Perruchot, C.; Heitz, V.; Jacquot de Rouville, H.-P. |
Journal of publication |
New Journal of Chemistry |
Year of publication |
2018 |
Journal volume |
42 |
Journal issue |
6 |
Pages of publication |
4728 |
a |
7.9128 ± 0.0006 Å |
b |
16.8566 ± 0.0012 Å |
c |
17.3103 ± 0.0012 Å |
α |
88.592 ± 0.002° |
β |
88.414 ± 0.002° |
γ |
82.929 ± 0.002° |
Cell volume |
2289.9 ± 0.3 Å3 |
Cell temperature |
200 ± 2 K |
Ambient diffraction temperature |
200 ± 2 K |
Number of distinct elements |
5 |
Space group number |
2 |
Hermann-Mauguin space group symbol |
P -1 |
Hall space group symbol |
-P 1 |
Residual factor for all reflections |
0.0628 |
Residual factor for significantly intense reflections |
0.047 |
Weighted residual factors for significantly intense reflections |
0.1289 |
Weighted residual factors for all reflections included in the refinement |
0.1414 |
Goodness-of-fit parameter for all reflections included in the refinement |
1.039 |
Diffraction radiation wavelength |
0.71073 Å |
Diffraction radiation type |
MoKα |
Yes |
Yes |
No |