Information card for entry 7057017
Formula | C24 H38 Br2 Cu N12 O9 |
Calculated formula | C24 H36 Br2 Cu N12 O9 |
Title of publication | Influence of water on the structure and magnetic properties of a copper bromide coordination compound with 3-amino-4-ethoxycarbonylpyrazole |
Authors of publication | Berezin, A. S.; Ivanova, A. D.; Komarov, V. Yu.; Nadolinny, V. A.; Lavrenova, L. G. |
Journal of publication | New Journal of Chemistry |
Year of publication | 2018 |
Journal volume | 42 |
Journal issue | 7 |
Pages of publication | 4902 |
a | 30.7828 ± 0.0017 Å |
b | 5.6317 ± 0.0003 Å |
c | 20.8991 ± 0.0012 Å |
α | 90° |
β | 100.075 ± 0.002° |
γ | 90° |
Cell volume | 3567.2 ± 0.3 Å3 |
Cell temperature | 150 K |
Ambient diffraction temperature | 150 K |
Number of distinct elements | 6 |
Space group number | 9 |
Hermann-Mauguin space group symbol | C 1 c 1 |
Hall space group symbol | C -2yc |
Residual factor for all reflections | 0.0497 |
Residual factor for significantly intense reflections | 0.0331 |
Weighted residual factors for significantly intense reflections | 0.0754 |
Weighted residual factors for all reflections included in the refinement | 0.0816 |
Goodness-of-fit parameter for all reflections included in the refinement | 1.028 |
Diffraction radiation wavelength | 0.71073 Å |
Diffraction radiation type | MoKα |