Information card for entry 7057058
Formula | C24 H27 N3 Ni O6 Pb S |
Calculated formula | C24 H27 N3 Ni O6 Pb S |
Title of publication | Non-covalent tetrel bonding interactions in hemidirectional lead(ii) complexes with nickel(ii)-salen type metalloligands |
Authors of publication | Roy, Sourav; Drew, Michael G. B.; Bauzá, Antonio; Frontera, Antonio; Chattopadhyay, Shouvik |
Journal of publication | New Journal of Chemistry |
Year of publication | 2018 |
Journal volume | 42 |
Journal issue | 8 |
Pages of publication | 6062 |
a | 12.6526 ± 0.0007 Å |
b | 14.8338 ± 0.0008 Å |
c | 13.9646 ± 0.0008 Å |
α | 90° |
β | 104.762 ± 0.006° |
γ | 90° |
Cell volume | 2534.5 ± 0.3 Å3 |
Cell temperature | 150 ± 2 K |
Ambient diffraction temperature | 150 ± 2 K |
Number of distinct elements | 7 |
Space group number | 14 |
Hermann-Mauguin space group symbol | P 1 21/n 1 |
Hall space group symbol | -P 2yn |
Residual factor for all reflections | 0.0859 |
Residual factor for significantly intense reflections | 0.0648 |
Weighted residual factors for significantly intense reflections | 0.1379 |
Weighted residual factors for all reflections included in the refinement | 0.1494 |
Goodness-of-fit parameter for all reflections included in the refinement | 1.032 |
Diffraction radiation wavelength | 0.71073 Å |
Diffraction radiation type | MoKα |