Information card for entry 7057061
Formula | C21 H28 Cl2 N2 Ni O6 Pb |
Calculated formula | C21 H28 Cl2 N2 Ni O6 Pb |
Title of publication | Non-covalent tetrel bonding interactions in hemidirectional lead(ii) complexes with nickel(ii)-salen type metalloligands |
Authors of publication | Roy, Sourav; Drew, Michael G. B.; Bauzá, Antonio; Frontera, Antonio; Chattopadhyay, Shouvik |
Journal of publication | New Journal of Chemistry |
Year of publication | 2018 |
Journal volume | 42 |
Journal issue | 8 |
Pages of publication | 6062 |
a | 14.76 ± 0.003 Å |
b | 12.3947 ± 0.0015 Å |
c | 14.3 ± 0.003 Å |
α | 90° |
β | 110.72 ± 0.02° |
γ | 90° |
Cell volume | 2446.9 ± 0.8 Å3 |
Cell temperature | 150 ± 2 K |
Ambient diffraction temperature | 150 ± 2 K |
Number of distinct elements | 7 |
Space group number | 15 |
Hermann-Mauguin space group symbol | C 1 2/c 1 |
Hall space group symbol | -C 2yc |
Residual factor for all reflections | 0.1076 |
Residual factor for significantly intense reflections | 0.0758 |
Weighted residual factors for significantly intense reflections | 0.157 |
Weighted residual factors for all reflections included in the refinement | 0.1766 |
Goodness-of-fit parameter for all reflections included in the refinement | 1.061 |
Diffraction radiation wavelength | 0.71073 Å |
Diffraction radiation type | MoKα |