Information card for entry 7057064
Formula | C8 H9 Co0.29 Li Mg0.21 N3 O5 |
Calculated formula | C8 H9 Co0.2875 Li Mg0.2125 N3 O5 |
Title of publication | Mg1−xCoxLi2(3,5-pdcH)2(DMF)2 (x = 0, 0.285, 0.575, 1): a series of heterometallic coordination polymers doped with magnetic Co2+ ions |
Authors of publication | Song, Ying; Tian, Chong-Bin; Wu, Zhao-Feng; Huang, Xiao-Ying |
Journal of publication | New Journal of Chemistry |
Year of publication | 2018 |
Journal volume | 42 |
Journal issue | 7 |
Pages of publication | 5096 |
a | 14.7194 ± 0.0007 Å |
b | 8.8624 ± 0.0004 Å |
c | 16.4634 ± 0.0008 Å |
α | 90° |
β | 90° |
γ | 90° |
Cell volume | 2147.64 ± 0.18 Å3 |
Cell temperature | 293 ± 2 K |
Ambient diffraction temperature | 293 ± 2 K |
Number of distinct elements | 7 |
Space group number | 60 |
Hermann-Mauguin space group symbol | P b c n |
Hall space group symbol | -P 2n 2ab |
Residual factor for all reflections | 0.0899 |
Residual factor for significantly intense reflections | 0.0472 |
Weighted residual factors for significantly intense reflections | 0.0782 |
Weighted residual factors for all reflections included in the refinement | 0.0926 |
Goodness-of-fit parameter for all reflections included in the refinement | 1.009 |
Diffraction radiation wavelength | 0.71073 Å |
Diffraction radiation type | MoKα |