Information card for entry 7057069
Chemical name | Flucytosine/Gallic acid |
Formula | C11 H10 F N3 O6 |
Calculated formula | C11 H10 F N3 O6 |
Title of publication | Synthesis of cocrystals/salts of flucytosine: Structure and stability |
Authors of publication | Nechipadappu, Sunil Kumar; Ramachandran, Jeeshma; Shivalingegowda, Naveen; Lokanath, Neratur Krishnappagowda; Trivedi, Darshak R. |
Journal of publication | New Journal of Chemistry |
Year of publication | 2018 |
Journal volume | 42 |
Journal issue | 7 |
Pages of publication | 5433 |
a | 5.283 ± 0.002 Å |
b | 17.757 ± 0.007 Å |
c | 12.125 ± 0.005 Å |
α | 90° |
β | 95.183 ± 0.012° |
γ | 90° |
Cell volume | 1132.8 ± 0.8 Å3 |
Cell temperature | 296 ± 2 K |
Ambient diffraction temperature | 296 ± 2 K |
Number of distinct elements | 5 |
Space group number | 14 |
Hermann-Mauguin space group symbol | P 1 21/n 1 |
Hall space group symbol | -P 2yn |
Residual factor for all reflections | 0.0943 |
Residual factor for significantly intense reflections | 0.0564 |
Weighted residual factors for significantly intense reflections | 0.1566 |
Weighted residual factors for all reflections included in the refinement | 0.162 |
Goodness-of-fit parameter for all reflections included in the refinement | 1.181 |
Diffraction radiation wavelength | 1.54178 Å |
Diffraction radiation type | CuKα |