Information card for entry 7057088
Formula | C24 H22 Mo N2 O4 |
Calculated formula | C24 H22 Mo N2 O4 |
Title of publication | Oxygen atom transfer between DMSO and benzoin catalyzed by cis-dioxidomolybdenum(vi) complexes of tetradentate Mannich bases |
Authors of publication | Maurya, Mannar R.; Mengesha, Bekele; Uprety, Bhawna; Jangra, Nancy; Tomar, Reshu; Avecilla, Fernando |
Journal of publication | New Journal of Chemistry |
Year of publication | 2018 |
Journal volume | 42 |
Journal issue | 8 |
Pages of publication | 6225 |
a | 15.164 ± 0.002 Å |
b | 12.8563 ± 0.0018 Å |
c | 10.6927 ± 0.0014 Å |
α | 90° |
β | 90.963 ± 0.007° |
γ | 90° |
Cell volume | 2084.3 ± 0.5 Å3 |
Cell temperature | 296 ± 2 K |
Ambient diffraction temperature | 296 ± 2 K |
Number of distinct elements | 5 |
Space group number | 14 |
Hermann-Mauguin space group symbol | P 1 21/c 1 |
Hall space group symbol | -P 2ybc |
Residual factor for all reflections | 0.0615 |
Residual factor for significantly intense reflections | 0.0352 |
Weighted residual factors for significantly intense reflections | 0.0926 |
Weighted residual factors for all reflections included in the refinement | 0.1228 |
Goodness-of-fit parameter for all reflections included in the refinement | 1.093 |
Diffraction radiation wavelength | 0.71073 Å |
Diffraction radiation type | MoKα |