Information card for entry 7057090
Formula | C26 H38 Mo N2 O4 |
Calculated formula | C26 H38 Mo N2 O4 |
Title of publication | Oxygen atom transfer between DMSO and benzoin catalyzed by cis-dioxidomolybdenum(vi) complexes of tetradentate Mannich bases |
Authors of publication | Maurya, Mannar R.; Mengesha, Bekele; Uprety, Bhawna; Jangra, Nancy; Tomar, Reshu; Avecilla, Fernando |
Journal of publication | New Journal of Chemistry |
Year of publication | 2018 |
Journal volume | 42 |
Journal issue | 8 |
Pages of publication | 6225 |
a | 12.9405 ± 0.0004 Å |
b | 14.038 ± 0.0004 Å |
c | 28.3268 ± 0.001 Å |
α | 90° |
β | 90° |
γ | 90° |
Cell volume | 5145.8 ± 0.3 Å3 |
Cell temperature | 293 ± 2 K |
Ambient diffraction temperature | 293 ± 2 K |
Number of distinct elements | 5 |
Space group number | 61 |
Hermann-Mauguin space group symbol | P c a b |
Hall space group symbol | -P 2bc 2ac |
Residual factor for all reflections | 0.0807 |
Residual factor for significantly intense reflections | 0.0367 |
Weighted residual factors for significantly intense reflections | 0.0854 |
Weighted residual factors for all reflections included in the refinement | 0.1059 |
Goodness-of-fit parameter for all reflections included in the refinement | 0.937 |
Diffraction radiation wavelength | 0.71073 Å |
Diffraction radiation type | MoKα |