Information card for entry 7057129
Formula | C32 H40 Cl Cu2 N5 O11 |
Calculated formula | C32 H40 Cl Cu2 N5 O11 |
Title of publication | Octadentate flexible ligands as a platform for a variety of homo and heterometallic complexes containing diphenoxido and phenoxido/azido bridging groups: synthesis, structure and magnetic properties |
Authors of publication | Pramanik, Koushik; Malpaharia, Pijush; Colacio, Enrique; Das, Babulal; Chandra, Swapan K. |
Journal of publication | New Journal of Chemistry |
Year of publication | 2018 |
Journal volume | 42 |
Journal issue | 8 |
Pages of publication | 6332 |
a | 11.1835 ± 0.0003 Å |
b | 15.4275 ± 0.0004 Å |
c | 20.3944 ± 0.0005 Å |
α | 90° |
β | 101.173 ± 0.002° |
γ | 90° |
Cell volume | 3452.02 ± 0.16 Å3 |
Cell temperature | 296 ± 2 K |
Ambient diffraction temperature | 296 ± 2 K |
Number of distinct elements | 6 |
Space group number | 14 |
Hermann-Mauguin space group symbol | P 1 21/c 1 |
Hall space group symbol | -P 2ybc |
Residual factor for all reflections | 0.0791 |
Residual factor for significantly intense reflections | 0.0488 |
Weighted residual factors for significantly intense reflections | 0.1405 |
Weighted residual factors for all reflections included in the refinement | 0.164 |
Goodness-of-fit parameter for all reflections included in the refinement | 1.012 |
Diffraction radiation wavelength | 0.71073 Å |
Diffraction radiation type | MoKα |