Information card for entry 7057131
Formula | C30 H35 N9 Ni2 O12 S |
Calculated formula | C30 H35 N9 Ni2 O12 S |
Title of publication | Octadentate flexible ligands as a platform for a variety of homo and heterometallic complexes containing diphenoxido and phenoxido/azido bridging groups: synthesis, structure and magnetic properties |
Authors of publication | Pramanik, Koushik; Malpaharia, Pijush; Colacio, Enrique; Das, Babulal; Chandra, Swapan K. |
Journal of publication | New Journal of Chemistry |
Year of publication | 2018 |
Journal volume | 42 |
Journal issue | 8 |
Pages of publication | 6332 |
a | 11.5055 ± 0.0002 Å |
b | 13.2976 ± 0.0002 Å |
c | 13.8302 ± 0.0004 Å |
α | 88.112 ± 0.001° |
β | 71.851 ± 0.001° |
γ | 64.975 ± 0.001° |
Cell volume | 1809.89 ± 0.07 Å3 |
Cell temperature | 296 ± 2 K |
Ambient diffraction temperature | 296 ± 2 K |
Number of distinct elements | 6 |
Space group number | 2 |
Hermann-Mauguin space group symbol | P -1 |
Hall space group symbol | -P 1 |
Residual factor for all reflections | 0.0619 |
Residual factor for significantly intense reflections | 0.0367 |
Weighted residual factors for significantly intense reflections | 0.0798 |
Weighted residual factors for all reflections included in the refinement | 0.0904 |
Goodness-of-fit parameter for all reflections included in the refinement | 1.005 |
Diffraction radiation wavelength | 0.71073 Å |
Diffraction radiation type | MoKα |