Information card for entry 7057149
Formula | C28 H28 Co N4 O4 |
Calculated formula | C28 H24 Co N4 O4 |
Title of publication | Exploring the multifunctionality in metal‒organic framework materials: how do the stilbenedicarboxylate and imidazolyl ligands tune the characteristics of coordination polymers? |
Authors of publication | Barsukova, Marina O.; Sapchenko, Sergey A.; Kovalenko, Konstantin A.; Samsonenko, Denis G.; Potapov, Andrei S.; Dybtsev, Danil N.; Fedin, Vladimir P. |
Journal of publication | New Journal of Chemistry |
Year of publication | 2018 |
Journal volume | 42 |
Journal issue | 8 |
Pages of publication | 6408 |
a | 8.7112 ± 0.0007 Å |
b | 14.5251 ± 0.0018 Å |
c | 23.5166 ± 0.0018 Å |
α | 90° |
β | 90° |
γ | 90° |
Cell volume | 2975.6 ± 0.5 Å3 |
Cell temperature | 130 ± 2 K |
Ambient diffraction temperature | 130 ± 2 K |
Number of distinct elements | 5 |
Space group number | 60 |
Hermann-Mauguin space group symbol | P b c n |
Hall space group symbol | -P 2n 2ab |
Residual factor for all reflections | 0.1512 |
Residual factor for significantly intense reflections | 0.1377 |
Weighted residual factors for significantly intense reflections | 0.3542 |
Weighted residual factors for all reflections included in the refinement | 0.3638 |
Goodness-of-fit parameter for all reflections included in the refinement | 1.2 |
Diffraction radiation probe | x-ray |
Diffraction radiation wavelength | 0.71073 Å |
Diffraction radiation type | MoKα |