Information card for entry 7057151
Formula
C40 H52 Dy2 Mn2 N5 O24
Calculated formula
C40 H46 Dy2 Mn2 N5 O24
Title of publication
Two tetranuclear 3d‒4f heterometal complexes Mn2Ln2 (Ln = Dy, Gd): synthesis, structure, magnetism, and electrocatalytic reactivity for water oxidation
Authors of publication
Lan, Tian-Xiang; Gao, Wei-Song; Chen, Chang-Neng; Wang, Hui-Sheng; Wang, Mei; Fan, Yu-hua
Journal of publication
New Journal of Chemistry
Year of publication
2018
Journal volume
42
Journal issue
8
Pages of publication
5798
a
11.469 ± 0.007 Å
b
21.21 ± 0.012 Å
c
21.144 ± 0.012 Å
α
90°
β
101.134 ± 0.011°
γ
90°
Cell volume
5047 ± 5 Å3
Cell temperature
173 ± 2 K
Ambient diffraction temperature
173 ± 2 K
Number of distinct elements
6
Space group number
15
Hermann-Mauguin space group symbol
C 1 2/c 1
Hall space group symbol
-C 2yc
Residual factor for significantly intense reflections
0.062
Weighted residual factors for significantly intense reflections
0.1428
Weighted residual factors for all reflections included in the refinement
0.158
Goodness-of-fit parameter for all reflections included in the refinement
1.091
Diffraction radiation wavelength
0.71073 Å
Diffraction radiation type
MoKα
Yes
No
No