Information card for entry 7057157
Formula | C34 H26 I2 N2 Se4 |
Calculated formula | C34 H26 I2 N2 Se4 |
Title of publication | Structural diversity in the products formed by the reactions of 2-arylselanyl pyridine derivatives and dihalogens |
Authors of publication | Montis, Riccardo; Arca, Massimiliano; Aragoni, M. Carla; Blake, Alexander J.; Castellano, Carlo; Demartin, Francesco; Isaia, Francesco; Lippolis, Vito; Pintus, Anna; Lenardão, Eder J.; Perin, Gelson; O'Connor, Alice E.; Thurow, Samuel |
Journal of publication | New Journal of Chemistry |
Year of publication | 2018 |
Journal volume | 42 |
Journal issue | 13 |
Pages of publication | 10592 |
a | 7.5865 ± 0.0015 Å |
b | 10.754 ± 0.002 Å |
c | 11.459 ± 0.002 Å |
α | 85.98 ± 0.03° |
β | 75.81 ± 0.03° |
γ | 74.76 ± 0.03° |
Cell volume | 874.5 ± 0.3 Å3 |
Cell temperature | 294 ± 2 K |
Ambient diffraction temperature | 294 ± 2 K |
Number of distinct elements | 5 |
Space group number | 2 |
Hermann-Mauguin space group symbol | P -1 |
Hall space group symbol | -P 1 |
Residual factor for all reflections | 0.0598 |
Residual factor for significantly intense reflections | 0.0371 |
Weighted residual factors for significantly intense reflections | 0.0953 |
Weighted residual factors for all reflections included in the refinement | 0.1041 |
Goodness-of-fit parameter for all reflections included in the refinement | 1.044 |
Diffraction radiation wavelength | 0.71073 Å |
Diffraction radiation type | MoKα |