Information card for entry 7057159
Formula | C17 H13 N Se2 |
Calculated formula | C17 H13 N Se2 |
Title of publication | Structural diversity in the products formed by the reactions of 2-arylselanyl pyridine derivatives and dihalogens |
Authors of publication | Montis, Riccardo; Arca, Massimiliano; Aragoni, M. Carla; Blake, Alexander J.; Castellano, Carlo; Demartin, Francesco; Isaia, Francesco; Lippolis, Vito; Pintus, Anna; Lenardão, Eder J.; Perin, Gelson; O'Connor, Alice E.; Thurow, Samuel |
Journal of publication | New Journal of Chemistry |
Year of publication | 2018 |
Journal volume | 42 |
Journal issue | 13 |
Pages of publication | 10592 |
a | 14.0396 ± 0.0003 Å |
b | 18.3594 ± 0.0005 Å |
c | 5.76067 ± 0.00013 Å |
α | 90° |
β | 90° |
γ | 90° |
Cell volume | 1484.86 ± 0.06 Å3 |
Cell temperature | 119.98 ± 0.11 K |
Ambient diffraction temperature | 119.98 ± 0.11 K |
Number of distinct elements | 4 |
Space group number | 33 |
Hermann-Mauguin space group symbol | P n a 21 |
Hall space group symbol | P 2c -2n |
Residual factor for all reflections | 0.015 |
Residual factor for significantly intense reflections | 0.0147 |
Weighted residual factors for significantly intense reflections | 0.0379 |
Weighted residual factors for all reflections included in the refinement | 0.0381 |
Goodness-of-fit parameter for all reflections included in the refinement | 1.057 |
Diffraction radiation probe | x-ray |
Diffraction radiation wavelength | 1.54184 Å |
Diffraction radiation type | CuKα |