Information card for entry 7057162
Formula | C11 H8 Cl2 I N Se |
Calculated formula | C11 H8 Cl2 I N Se |
Title of publication | Structural diversity in the products formed by the reactions of 2-arylselanyl pyridine derivatives and dihalogens |
Authors of publication | Montis, Riccardo; Arca, Massimiliano; Aragoni, M. Carla; Blake, Alexander J.; Castellano, Carlo; Demartin, Francesco; Isaia, Francesco; Lippolis, Vito; Pintus, Anna; Lenardão, Eder J.; Perin, Gelson; O'Connor, Alice E.; Thurow, Samuel |
Journal of publication | New Journal of Chemistry |
Year of publication | 2018 |
Journal volume | 42 |
Journal issue | 13 |
Pages of publication | 10592 |
a | 7.336 ± 0.0004 Å |
b | 9.7341 ± 0.0005 Å |
c | 10.2629 ± 0.0005 Å |
α | 104.09 ± 0.01° |
β | 107.27 ± 0.01° |
γ | 102.43 ± 0.01° |
Cell volume | 645.24 ± 0.1 Å3 |
Cell temperature | 294 ± 2 K |
Ambient diffraction temperature | 294 ± 2 K |
Number of distinct elements | 6 |
Space group number | 2 |
Hermann-Mauguin space group symbol | P -1 |
Hall space group symbol | -P 1 |
Residual factor for all reflections | 0.0301 |
Residual factor for significantly intense reflections | 0.0261 |
Weighted residual factors for significantly intense reflections | 0.0783 |
Weighted residual factors for all reflections included in the refinement | 0.082 |
Goodness-of-fit parameter for all reflections included in the refinement | 1.055 |
Diffraction radiation wavelength | 0.71073 Å |
Diffraction radiation type | MoKα |