Information card for entry 7057164
Chemical name | (3-iodoethynylbenzoate)2(piperidinium) |
Formula | C11 H10 I N O2 |
Calculated formula | C11 H10 I N O2 |
Title of publication | Mechanochemistry and cocrystallization of 3-iodoethynylbenzoic acid with nitrogen-containing heterocycles: concurrent halogen and hydrogen bonding |
Authors of publication | Szell, Patrick M. J.; Dragon, Julien; Zablotny, Scott; Harrigan, Stephen R.; Gabidullin, Bulat; Bryce, David L. |
Journal of publication | New Journal of Chemistry |
Year of publication | 2018 |
Journal volume | 42 |
Journal issue | 13 |
Pages of publication | 10493 |
a | 16.7005 ± 0.0008 Å |
b | 8.0961 ± 0.0004 Å |
c | 8.3096 ± 0.0004 Å |
α | 90° |
β | 90.243 ± 0.003° |
γ | 90° |
Cell volume | 1123.52 ± 0.09 Å3 |
Cell temperature | 200 ± 2 K |
Ambient diffraction temperature | 200 ± 2 K |
Number of distinct elements | 5 |
Space group number | 14 |
Hermann-Mauguin space group symbol | P 1 21/c 1 |
Hall space group symbol | -P 2ybc |
Residual factor for all reflections | 0.0573 |
Residual factor for significantly intense reflections | 0.0338 |
Weighted residual factors for significantly intense reflections | 0.0729 |
Weighted residual factors for all reflections included in the refinement | 0.0814 |
Goodness-of-fit parameter for all reflections included in the refinement | 1.039 |
Diffraction radiation wavelength | 0.71073 Å |
Diffraction radiation type | MoKα |