Information card for entry 7057174
Formula | C22 H23 N3 O2 |
Calculated formula | C22 H23 N3 O2 |
Title of publication | Enantiopure Schiff bases of amino acid phenylhydrazides: impact of the hydrazide function on their structures and properties |
Authors of publication | Bouzayani, Nadia; Marque, Sylvain; Djelassi, Brahim; Kacem, Yakdhane; Marrot, Jérôme; Ben Hassine, Béchir |
Journal of publication | New Journal of Chemistry |
Year of publication | 2018 |
Journal volume | 42 |
Journal issue | 8 |
Pages of publication | 6389 |
a | 10.3964 ± 0.0005 Å |
b | 10.8708 ± 0.0005 Å |
c | 17.519 ± 0.0007 Å |
α | 90° |
β | 90° |
γ | 90° |
Cell volume | 1979.95 ± 0.15 Å3 |
Cell temperature | 200 ± 2 K |
Ambient diffraction temperature | 200 ± 2 K |
Number of distinct elements | 4 |
Space group number | 19 |
Hermann-Mauguin space group symbol | P 21 21 21 |
Hall space group symbol | P 2ac 2ab |
Residual factor for all reflections | 0.0398 |
Residual factor for significantly intense reflections | 0.0345 |
Weighted residual factors for significantly intense reflections | 0.087 |
Weighted residual factors for all reflections included in the refinement | 0.0903 |
Goodness-of-fit parameter for all reflections included in the refinement | 1.048 |
Diffraction radiation wavelength | 0.71073 Å |
Diffraction radiation type | MoKα |