Information card for entry 7057176
Formula | C45 H32 N4 S4 |
Calculated formula | C45 H32 N4 S4 |
Title of publication | Three-dimensional conductive porous organic polymers based on tetrahedral polythiophene for high-performance supercapacitors |
Authors of publication | Li, Tao; Zhu, Wei; Shen, Rui; Wang, Hui-Ying; Chen, Wei; Hao, Si-Jia; Li, Yunxing; Gu, Zhi-Guo; Li, Zaijun |
Journal of publication | New Journal of Chemistry |
Year of publication | 2018 |
Journal volume | 42 |
Journal issue | 8 |
Pages of publication | 6247 |
a | 22.728 ± 0.006 Å |
b | 7.4934 ± 0.0018 Å |
c | 21.408 ± 0.006 Å |
α | 90° |
β | 90.113 ± 0.011° |
γ | 90° |
Cell volume | 3646 ± 1.7 Å3 |
Cell temperature | 173 ± 2 K |
Ambient diffraction temperature | 173 ± 2 K |
Number of distinct elements | 4 |
Space group number | 15 |
Hermann-Mauguin space group symbol | C 1 2/c 1 |
Hall space group symbol | -C 2yc |
Residual factor for all reflections | 0.1432 |
Residual factor for significantly intense reflections | 0.0811 |
Weighted residual factors for significantly intense reflections | 0.1947 |
Weighted residual factors for all reflections included in the refinement | 0.2266 |
Goodness-of-fit parameter for all reflections included in the refinement | 1.168 |
Diffraction radiation wavelength | 0.71073 Å |
Diffraction radiation type | MoKα |