Information card for entry 7057186
Formula | C15 H7 F3 N2 O S |
Calculated formula | C15 H7 F3 N2 O S |
Title of publication | Synthesis, characterization, and optical and surface properties of (4-(trifluoromethylthio)phenoxy) copper(ii) phthalocyanine |
Authors of publication | Günsel, Armağan; Bilgiçli, Ahmet T.; Pişkin, Hasan; Çaylak Delibaş, Nagihan; Yarasir, M. Nilüfer; Gündüz, Bayram |
Journal of publication | New Journal of Chemistry |
Year of publication | 2018 |
Journal volume | 42 |
Journal issue | 8 |
Pages of publication | 6013 |
a | 7.9423 ± 0.0011 Å |
b | 8.3974 ± 0.001 Å |
c | 11.4457 ± 0.0016 Å |
α | 99.623 ± 0.009° |
β | 101.966 ± 0.009° |
γ | 98.974 ± 0.009° |
Cell volume | 721.75 ± 0.17 Å3 |
Cell temperature | 296 ± 2 K |
Ambient diffraction temperature | 296 ± 2 K |
Number of distinct elements | 6 |
Space group number | 2 |
Hermann-Mauguin space group symbol | P -1 |
Hall space group symbol | -P 1 |
Residual factor for all reflections | 0.0728 |
Residual factor for significantly intense reflections | 0.0472 |
Weighted residual factors for significantly intense reflections | 0.105 |
Weighted residual factors for all reflections included in the refinement | 0.1202 |
Goodness-of-fit parameter for all reflections included in the refinement | 1.049 |
Diffraction radiation wavelength | 0.71073 Å |
Diffraction radiation type | MoKα |