Information card for entry 7057199
Formula | C78 H82 Mn6 N8 O24 |
Calculated formula | C78 H82 Mn6 N8 O24 |
Title of publication | A step-ladder manganese(iii) metallacrown hosting mefenamic acid and a manganese(ii)‒mefanamato complex: synthesis, characterization and cytotoxic activity |
Authors of publication | Tarushi, Alketa; Geromichalos, George D.; Lafazanis, Kostas; Raptopoulou, Catherine P.; Psycharis, Vassilis; Lalioti, Nikolia; Pantazaki, Anastasia A.; Kessissoglou, Dimitris P.; Tangoulis, Vassilis; Psomas, George |
Journal of publication | New Journal of Chemistry |
Year of publication | 2018 |
Journal volume | 42 |
Journal issue | 9 |
Pages of publication | 6955 |
a | 12.7551 ± 0.0002 Å |
b | 13.1558 ± 0.0002 Å |
c | 25.5659 ± 0.0005 Å |
α | 104.738 ± 0.001° |
β | 98.599 ± 0.001° |
γ | 94.89 ± 0.001° |
Cell volume | 4068.03 ± 0.12 Å3 |
Cell temperature | 160 ± 2 K |
Ambient diffraction temperature | 160 ± 2 K |
Number of distinct elements | 5 |
Space group number | 2 |
Hermann-Mauguin space group symbol | P -1 |
Hall space group symbol | -P 1 |
Residual factor for all reflections | 0.1096 |
Residual factor for significantly intense reflections | 0.0734 |
Weighted residual factors for significantly intense reflections | 0.1776 |
Weighted residual factors for all reflections included in the refinement | 0.232 |
Goodness-of-fit parameter for all reflections included in the refinement | 1.153 |
Diffraction radiation wavelength | 1.54178 Å |
Diffraction radiation type | CuKα |