Information card for entry 7057216
Formula | C18 H26 Cl2 N4 Ni O8 |
Calculated formula | C18 H26 Cl2 N4 Ni O8 |
Title of publication | Triphenylstibine-substituted Fischer carbene complexes of tungsten(0): synthesis, structure, DFT and electrochemistry |
Authors of publication | Landman, Marilé; Jansen van Rensburg, Armand; van Rooyen, Petrus H.; Conradie, Marrigje M.; Conradie, Jeanet |
Journal of publication | New Journal of Chemistry |
Year of publication | 2018 |
Journal volume | 42 |
Journal issue | 9 |
Pages of publication | 7301 |
a | 15.599 ± 0.006 Å |
b | 9.111 ± 0.004 Å |
c | 16.219 ± 0.006 Å |
α | 90° |
β | 97.508 ± 0.009° |
γ | 90° |
Cell volume | 2285.3 ± 1.6 Å3 |
Cell temperature | 293 ± 2 K |
Ambient diffraction temperature | 293 ± 2 K |
Number of distinct elements | 6 |
Space group number | 14 |
Hermann-Mauguin space group symbol | P 1 21/c 1 |
Hall space group symbol | -P 2ybc |
Residual factor for all reflections | 0.0673 |
Residual factor for significantly intense reflections | 0.0458 |
Weighted residual factors for significantly intense reflections | 0.1111 |
Weighted residual factors for all reflections included in the refinement | 0.1174 |
Goodness-of-fit parameter for all reflections included in the refinement | 1.099 |
Diffraction radiation wavelength | 0.71073 Å |
Diffraction radiation type | MoKα |