Information card for entry 7057218
Formula | C82 H48 F20 N6 O22 Zn7 |
Calculated formula | C82 H48 F20 N6 O22 Zn7 |
Title of publication | Triphenylstibine-substituted Fischer carbene complexes of tungsten(0): synthesis, structure, DFT and electrochemistry |
Authors of publication | Landman, Marilé; Jansen van Rensburg, Armand; van Rooyen, Petrus H.; Conradie, Marrigje M.; Conradie, Jeanet |
Journal of publication | New Journal of Chemistry |
Year of publication | 2018 |
Journal volume | 42 |
Journal issue | 9 |
Pages of publication | 7301 |
a | 12.618 ± 0.002 Å |
b | 14.324 ± 0.002 Å |
c | 14.933 ± 0.002 Å |
α | 62.979 ± 0.003° |
β | 84.892 ± 0.003° |
γ | 80.076 ± 0.003° |
Cell volume | 2368.2 ± 0.6 Å3 |
Cell temperature | 110 ± 2 K |
Ambient diffraction temperature | 110 ± 2 K |
Number of distinct elements | 6 |
Space group number | 2 |
Hermann-Mauguin space group symbol | P -1 |
Hall space group symbol | -P 1 |
Residual factor for all reflections | 0.094 |
Residual factor for significantly intense reflections | 0.0647 |
Weighted residual factors for significantly intense reflections | 0.2117 |
Weighted residual factors for all reflections included in the refinement | 0.2259 |
Goodness-of-fit parameter for all reflections included in the refinement | 1.026 |
Diffraction radiation wavelength | 0.71073 Å |
Diffraction radiation type | MoKα |