Information card for entry 7057227
Formula | C10 H6 Br2 Cl4 Cu N2 |
Calculated formula | C10 H6 Br2 Cl4 Cu N2 |
Title of publication | May halogen bonding interactions compete with Cu⋯Cl semi-coordinate bonds? Structural, magnetic and theoretical studies of two polymorphs of trans-bis(5-bromo-2-chloro pyridine)dichlorocopper(ii) and trans-bis(2,5-dichloropyridine)dichlorocopper(ii) |
Authors of publication | Awwadi, Firas F.; Turnbull, Mark M.; Alwahsh, Manal I.; Haddad, Salim F. |
Journal of publication | New Journal of Chemistry |
Year of publication | 2018 |
Journal volume | 42 |
Journal issue | 13 |
Pages of publication | 10642 |
a | 8.252 ± 0.0005 Å |
b | 12.8053 ± 0.0008 Å |
c | 14.6136 ± 0.0008 Å |
α | 90° |
β | 90.902 ± 0.005° |
γ | 90° |
Cell volume | 1544.02 ± 0.16 Å3 |
Cell temperature | 293 ± 2 K |
Ambient diffraction temperature | 293 ± 2 K |
Number of distinct elements | 6 |
Space group number | 15 |
Hermann-Mauguin space group symbol | C 1 2/c 1 |
Hall space group symbol | -C 2yc |
Residual factor for all reflections | 0.0464 |
Residual factor for significantly intense reflections | 0.0333 |
Weighted residual factors for significantly intense reflections | 0.0751 |
Weighted residual factors for all reflections included in the refinement | 0.0792 |
Goodness-of-fit parameter for all reflections included in the refinement | 1.013 |
Diffraction radiation wavelength | 0.71073 Å |
Diffraction radiation type | MoKα |