Information card for entry 7057240
Formula | C4 H4 Cu N2 O10 V4 |
Calculated formula | C4 H4 Cu N2 O10 V4 |
Title of publication | A new polyoxovanadate-based metal‒organic framework: synthesis, structure and photo-/electro-catalytic properties |
Authors of publication | Li, Shaobin; Zhang, Li; Lu, Borong; Yan, Eryun; Wang, Tonghui; Li, Li; Wang, Jianxin; Yu, Yan; Mu, Qingdi |
Journal of publication | New Journal of Chemistry |
Year of publication | 2018 |
Journal volume | 42 |
Journal issue | 9 |
Pages of publication | 7247 |
a | 14.243 ± 0.003 Å |
b | 6.9172 ± 0.0011 Å |
c | 11.5429 ± 0.0018 Å |
α | 90° |
β | 90° |
γ | 90° |
Cell volume | 1137.2 ± 0.3 Å3 |
Cell temperature | 296 ± 2 K |
Ambient diffraction temperature | 296 ± 2 K |
Number of distinct elements | 6 |
Space group number | 63 |
Hermann-Mauguin space group symbol | C m c m |
Hall space group symbol | -C 2c 2 |
Residual factor for all reflections | 0.0415 |
Residual factor for significantly intense reflections | 0.0371 |
Weighted residual factors for significantly intense reflections | 0.1043 |
Weighted residual factors for all reflections included in the refinement | 0.11 |
Goodness-of-fit parameter for all reflections included in the refinement | 1.055 |
Diffraction radiation wavelength | 0.71073 Å |
Diffraction radiation type | MoKα |