Information card for entry 7057260
Formula | C14 H14 Co N3 O6 |
Calculated formula | C14 H14 Co N3 O6 |
Title of publication | Fine-tuning the effects of auxiliary ligands on two trigonal-bipyramid cobalt(ii) complexes exhibiting field-induced slow magnetic relaxation |
Authors of publication | Hou, Xiangyang; Wang, Xiao; Liu, Xiangyu; Wang, Jijiang; Tang, Long; Ju, Ping |
Journal of publication | New Journal of Chemistry |
Year of publication | 2018 |
Journal volume | 42 |
Journal issue | 11 |
Pages of publication | 8583 |
a | 12.804 ± 0.002 Å |
b | 9.8015 ± 0.0017 Å |
c | 12.078 ± 0.002 Å |
α | 90° |
β | 92.057 ± 0.003° |
γ | 90° |
Cell volume | 1514.8 ± 0.4 Å3 |
Cell temperature | 293 ± 2 K |
Ambient diffraction temperature | 293 ± 2 K |
Number of distinct elements | 5 |
Space group number | 14 |
Hermann-Mauguin space group symbol | P 1 21/c 1 |
Hall space group symbol | -P 2ybc |
Residual factor for all reflections | 0.0648 |
Residual factor for significantly intense reflections | 0.0372 |
Weighted residual factors for significantly intense reflections | 0.0765 |
Weighted residual factors for all reflections included in the refinement | 0.0862 |
Goodness-of-fit parameter for all reflections included in the refinement | 1.031 |
Diffraction radiation wavelength | 0.71073 Å |
Diffraction radiation type | MoKα |