Information card for entry 7057270
Formula | C36 H44 B10 F3 N4 P |
Calculated formula | C36 H44 B10 F3 N4 P |
Title of publication | Mechanism of generation of closo-decaborato amidrazones. Intramolecular non-covalent B‒H⋯π(Ph) interaction determines stabilization of the configuration around the amidrazone CN bond |
Authors of publication | Burianova, Valeria K.; Bolotin, Dmitrii S.; Mikherdov, Alexander S.; Novikov, Alexander S.; Mokolokolo, Pennie Petrus; Roodt, Andreas; Boyarskiy, Vadim P.; Dar’in, Dmitry; Krasavin, Mikhail; Suslonov, Vitalii V.; Zhdanov, Andrey P.; Zhizhin, Konstantin Yu.; Kuznetsov, Nikolay T. |
Journal of publication | New Journal of Chemistry |
Year of publication | 2018 |
Journal volume | 42 |
Journal issue | 11 |
Pages of publication | 8693 |
a | 9.4224 ± 0.0004 Å |
b | 12.6542 ± 0.0007 Å |
c | 16.5596 ± 0.001 Å |
α | 73.363 ± 0.005° |
β | 83.321 ± 0.004° |
γ | 86.262 ± 0.004° |
Cell volume | 1877.9 ± 0.18 Å3 |
Cell temperature | 100 ± 2 K |
Ambient diffraction temperature | 100 ± 2 K |
Number of distinct elements | 6 |
Space group number | 2 |
Hermann-Mauguin space group symbol | P -1 |
Hall space group symbol | -P 1 |
Residual factor for all reflections | 0.0918 |
Residual factor for significantly intense reflections | 0.069 |
Weighted residual factors for significantly intense reflections | 0.1795 |
Weighted residual factors for all reflections included in the refinement | 0.1959 |
Goodness-of-fit parameter for all reflections included in the refinement | 1.044 |
Diffraction radiation probe | x-ray |
Diffraction radiation wavelength | 1.54184 Å |
Diffraction radiation type | CuKα |