Information card for entry 7057288
Formula | C19 H20 N2 O Pt S |
Calculated formula | C19 H20 N2 O Pt S |
Title of publication | Reactivity of a new aryl cycloplatinated(ii) complex containing rollover 2,2′-bipyridine N-oxide toward a series of diphosphine ligands |
Authors of publication | Shahsavari, Hamid R.; Babadi Aghakhanpour, Reza; Hossein-Abadi, Mojdeh; Kia, Reza; Halvagar, Mohammad Reza; Raithby, Paul R. |
Journal of publication | New Journal of Chemistry |
Year of publication | 2018 |
Journal volume | 42 |
Journal issue | 11 |
Pages of publication | 9159 |
a | 8.1277 ± 0.0016 Å |
b | 10.499 ± 0.002 Å |
c | 11.58 ± 0.002 Å |
α | 73.55 ± 0.03° |
β | 82.97 ± 0.03° |
γ | 73.6 ± 0.03° |
Cell volume | 908.2 ± 0.4 Å3 |
Cell temperature | 296 ± 2 K |
Ambient diffraction temperature | 296 ± 2 K |
Number of distinct elements | 6 |
Space group number | 2 |
Hermann-Mauguin space group symbol | P -1 |
Hall space group symbol | -P 1 |
Residual factor for all reflections | 0.0831 |
Residual factor for significantly intense reflections | 0.0475 |
Weighted residual factors for significantly intense reflections | 0.0897 |
Weighted residual factors for all reflections included in the refinement | 0.0969 |
Goodness-of-fit parameter for all reflections included in the refinement | 0.877 |
Diffraction radiation wavelength | 0.71073 Å |
Diffraction radiation type | MoKα |