Information card for entry 7057302
Formula | C60 H94 Co7 N6 O36 P6 |
Calculated formula | C60 H90 Co7 N6 O36 P6 |
Title of publication | New molecular heptanuclear cobalt phosphonates: synthesis, structures and magnetic properties |
Authors of publication | Doroshenko, Iaroslav; Babiak, Michal; Buchholz, Axel; Görls, Helmar; Plass, Winfried; Pinkas, Jiri |
Journal of publication | New Journal of Chemistry |
Year of publication | 2018 |
Journal volume | 42 |
Journal issue | 12 |
Pages of publication | 9568 |
a | 12.4872 ± 0.0003 Å |
b | 12.6637 ± 0.0002 Å |
c | 26.281 ± 0.0006 Å |
α | 90° |
β | 90.303 ± 0.001° |
γ | 90° |
Cell volume | 4155.87 ± 0.15 Å3 |
Cell temperature | 133 ± 2 K |
Ambient diffraction temperature | 133 ± 2 K |
Number of distinct elements | 6 |
Space group number | 14 |
Hermann-Mauguin space group symbol | P 1 21/n 1 |
Hall space group symbol | -P 2yn |
Residual factor for all reflections | 0.0559 |
Residual factor for significantly intense reflections | 0.0425 |
Weighted residual factors for significantly intense reflections | 0.082 |
Weighted residual factors for all reflections included in the refinement | 0.0869 |
Goodness-of-fit parameter for all reflections included in the refinement | 1.117 |
Diffraction radiation wavelength | 0.71073 Å |
Diffraction radiation type | MoKα |