Information card for entry 7057318
Formula | C16 H14 Cd N8 O6 |
Calculated formula | C16 H14 Cd N8 O6 |
Title of publication | Seven luminescent metal‒organic frameworks constructed from 5-(triazol-1-yl)nicotinic acid: luminescent sensors for CrVI and MnO4− ions in an aqueous medium |
Authors of publication | Yan, Yang-Tian; Cao, Feng; Zhang, Wen-Yan; Zhang, Si-Si; Zhang, Fang; Wang, Yao-Yu |
Journal of publication | New Journal of Chemistry |
Year of publication | 2018 |
Journal volume | 42 |
Journal issue | 12 |
Pages of publication | 9865 |
a | 11.912 ± 0.003 Å |
b | 7.1031 ± 0.0016 Å |
c | 11.937 ± 0.003 Å |
α | 90° |
β | 117.307 ± 0.003° |
γ | 90° |
Cell volume | 897.5 ± 0.4 Å3 |
Cell temperature | 296 ± 2 K |
Ambient diffraction temperature | 296.15 K |
Number of distinct elements | 5 |
Space group number | 14 |
Hermann-Mauguin space group symbol | P 1 21/c 1 |
Hall space group symbol | -P 2ybc |
Residual factor for all reflections | 0.0345 |
Residual factor for significantly intense reflections | 0.023 |
Weighted residual factors for significantly intense reflections | 0.0578 |
Weighted residual factors for all reflections included in the refinement | 0.0613 |
Goodness-of-fit parameter for all reflections included in the refinement | 1.065 |
Diffraction radiation wavelength | 0.71073 Å |
Diffraction radiation type | MoKα |