Information card for entry 7057329
Formula | C11 H28 B11 N |
Calculated formula | C11 H28 B11 N |
Title of publication | Triorganotin(iv) cation-promoted dimethyl carbonate synthesis from CO2and methanol: solution and solid-state characterization of an unexpected diorganotin(iv)-oxo cluster |
Authors of publication | Švec, Petr; Cattey, Hélène; Růžičková, Zdeňka; Holub, Josef; Růžička, Aleš; Plasseraud, Laurent |
Journal of publication | New Journal of Chemistry |
Year of publication | 2018 |
Journal volume | 42 |
Journal issue | 10 |
Pages of publication | 8253 |
a | 22.693 ± 0.004 Å |
b | 7.2234 ± 0.0011 Å |
c | 14.941 ± 0.003 Å |
α | 90° |
β | 131.136 ± 0.008° |
γ | 90° |
Cell volume | 1844.6 ± 0.6 Å3 |
Cell temperature | 115 K |
Ambient diffraction temperature | 115 K |
Number of distinct elements | 4 |
Space group number | 5 |
Hermann-Mauguin space group symbol | C 1 2 1 |
Hall space group symbol | C 2y |
Residual factor for all reflections | 0.0432 |
Residual factor for significantly intense reflections | 0.039 |
Weighted residual factors for significantly intense reflections | 0.0937 |
Weighted residual factors for all reflections included in the refinement | 0.0966 |
Goodness-of-fit parameter for all reflections included in the refinement | 1.024 |
Diffraction radiation probe | x-ray |
Diffraction radiation wavelength | 0.71073 Å |
Diffraction radiation type | MoKα |