Information card for entry 7058511
Formula | C17 H22 Au Cl Fe N P |
Calculated formula | C17 H22 Au Cl Fe N P |
Title of publication | Assessing the influence of phosphine substituents on the catalytic properties of self-stabilised digold(i) complexes with supporting ferrocene phosphinonitrile ligands |
Authors of publication | Bárta, Ondřej; Císařová, Ivana; Schulz, Jiří; Štěpnička, Petr |
Journal of publication | New Journal of Chemistry |
Year of publication | 2019 |
Journal volume | 43 |
Journal issue | 28 |
Pages of publication | 11258 |
a | 10.3726 ± 0.0005 Å |
b | 9.1257 ± 0.0005 Å |
c | 19.301 ± 0.0011 Å |
α | 90° |
β | 94.845 ± 0.002° |
γ | 90° |
Cell volume | 1820.45 ± 0.17 Å3 |
Cell temperature | 120 ± 2 K |
Ambient diffraction temperature | 120 ± 2 K |
Number of distinct elements | 7 |
Space group number | 14 |
Hermann-Mauguin space group symbol | P 1 21/n 1 |
Hall space group symbol | -P 2yn |
Residual factor for all reflections | 0.0147 |
Residual factor for significantly intense reflections | 0.013 |
Weighted residual factors for significantly intense reflections | 0.0262 |
Weighted residual factors for all reflections included in the refinement | 0.0266 |
Goodness-of-fit parameter for all reflections included in the refinement | 1.065 |
Diffraction radiation wavelength | 0.71073 Å |
Diffraction radiation type | MoKα |