Information card for entry 7058769
Formula | C22 H16 S Te |
Calculated formula | C22 H16 S Te |
Title of publication | Nature of the E⋯E′ interactions (E, E′ = O, S, Se, and Te) at naphthalene 1,8-positions with fine details of the structures: experimental and theoretical investigations |
Authors of publication | Hayashi, Satoko; Uegaito, Manabu; Nishide, Taro; Tanaka, Eiichiro; Nakanishi, Waro; Sasamori, Takahiro; Tokitoh, Norihiro; Minoura, Mao |
Journal of publication | New Journal of Chemistry |
Year of publication | 2019 |
Journal volume | 43 |
Journal issue | 36 |
Pages of publication | 14224 |
a | 9.941 ± 0.002 Å |
b | 11.2 ± 0.002 Å |
c | 17.991 ± 0.004 Å |
α | 73.943 ± 0.008° |
β | 87.143 ± 0.009° |
γ | 66.842 ± 0.007° |
Cell volume | 1765.9 ± 0.6 Å3 |
Cell temperature | 103 ± 2 K |
Ambient diffraction temperature | 103 ± 2 K |
Number of distinct elements | 4 |
Space group number | 2 |
Hermann-Mauguin space group symbol | P -1 |
Hall space group symbol | -P 1 |
Residual factor for all reflections | 0.0368 |
Residual factor for significantly intense reflections | 0.031 |
Weighted residual factors for significantly intense reflections | 0.0608 |
Weighted residual factors for all reflections included in the refinement | 0.063 |
Goodness-of-fit parameter for all reflections included in the refinement | 1.176 |
Diffraction radiation wavelength | 0.7107 Å |
Diffraction radiation type | MoKα |