Information card for entry 7058781
Formula | C20 H16 Cl2 N2 Zn |
Calculated formula | C20 H16 Cl2 N2 Zn |
Title of publication | A homo-chiral helical coordination polymer constructed from an achiral ligand with excellent photo-physical properties and cell imaging application |
Authors of publication | Ma, Xiaofan; Kong, Weili; Abudoureheman, Maierhaba; Zhang, Jun; Xuan, Xiaopeng |
Journal of publication | New Journal of Chemistry |
Year of publication | 2019 |
Journal volume | 43 |
Journal issue | 37 |
Pages of publication | 15023 |
a | 8.7877 ± 0.0006 Å |
b | 8.7877 ± 0.0006 Å |
c | 24.203 ± 0.003 Å |
α | 90° |
β | 90° |
γ | 90° |
Cell volume | 1869 ± 0.3 Å3 |
Cell temperature | 296 ± 2 K |
Ambient diffraction temperature | 296.15 K |
Number of distinct elements | 5 |
Space group number | 96 |
Hermann-Mauguin space group symbol | P 43 21 2 |
Hall space group symbol | P 4nw 2abw |
Residual factor for all reflections | 0.0245 |
Residual factor for significantly intense reflections | 0.0226 |
Weighted residual factors for significantly intense reflections | 0.0575 |
Weighted residual factors for all reflections included in the refinement | 0.0583 |
Goodness-of-fit parameter for all reflections included in the refinement | 1.11 |
Diffraction radiation probe | x-ray |
Diffraction radiation wavelength | 0.71073 Å |
Diffraction radiation type | MoKα |