Information card for entry 7058799
Formula | C18 H22 O4 P2 S3 |
Calculated formula | C18 H22 O4 P2 S3 |
Title of publication | Medium-sized cyclic bis(anisylphosphonothioyl)disulfanes and their corresponding cyclic sulfane-structures and most characteristic reactions |
Authors of publication | Przychodzeń, Witold; Chojnacki, Jarosław; Nierzwicki, Łukasz |
Journal of publication | New Journal of Chemistry |
Year of publication | 2019 |
Journal volume | 43 |
Journal issue | 38 |
Pages of publication | 15413 |
a | 8.5551 ± 0.0006 Å |
b | 10.9717 ± 0.0008 Å |
c | 13.0957 ± 0.001 Å |
α | 113.352 ± 0.007° |
β | 104.434 ± 0.007° |
γ | 93.127 ± 0.006° |
Cell volume | 1076.53 ± 0.16 Å3 |
Cell temperature | 293 ± 2 K |
Ambient diffraction temperature | 293 ± 2 K |
Number of distinct elements | 5 |
Space group number | 2 |
Hermann-Mauguin space group symbol | P -1 |
Hall space group symbol | -P 1 |
Residual factor for all reflections | 0.1288 |
Residual factor for significantly intense reflections | 0.0641 |
Weighted residual factors for significantly intense reflections | 0.1345 |
Weighted residual factors for all reflections included in the refinement | 0.18 |
Goodness-of-fit parameter for all reflections included in the refinement | 1.029 |
Diffraction radiation wavelength | 0.71073 Å |
Diffraction radiation type | MoKα |