Information card for entry 7058802
Formula | C19 H24 O4 P2 S4 |
Calculated formula | C19 H24 O4 P2 S4 |
Title of publication | Medium-sized cyclic bis(anisylphosphonothioyl)disulfanes and their corresponding cyclic sulfane-structures and most characteristic reactions |
Authors of publication | Przychodzeń, Witold; Chojnacki, Jarosław; Nierzwicki, Łukasz |
Journal of publication | New Journal of Chemistry |
Year of publication | 2019 |
Journal volume | 43 |
Journal issue | 38 |
Pages of publication | 15413 |
a | 12.3171 ± 0.0012 Å |
b | 9.1385 ± 0.0005 Å |
c | 21.439 ± 0.002 Å |
α | 90° |
β | 96.512 ± 0.008° |
γ | 90° |
Cell volume | 2397.6 ± 0.4 Å3 |
Cell temperature | 130 ± 2 K |
Ambient diffraction temperature | 130 ± 2 K |
Number of distinct elements | 5 |
Space group number | 14 |
Hermann-Mauguin space group symbol | P 1 21/c 1 |
Hall space group symbol | -P 2ybc |
Residual factor for all reflections | 0.0276 |
Residual factor for significantly intense reflections | 0.0253 |
Weighted residual factors for significantly intense reflections | 0.067 |
Weighted residual factors for all reflections included in the refinement | 0.0682 |
Goodness-of-fit parameter for all reflections included in the refinement | 1.067 |
Diffraction radiation wavelength | 0.71073 Å |
Diffraction radiation type | MoKα |