Information card for entry 7058805
Formula | C19 H24 O4 P2 S3 |
Calculated formula | C19 H24 O4 P2 S3 |
Title of publication | Medium-sized cyclic bis(anisylphosphonothioyl)disulfanes and their corresponding cyclic sulfane-structures and most characteristic reactions |
Authors of publication | Przychodzeń, Witold; Chojnacki, Jarosław; Nierzwicki, Łukasz |
Journal of publication | New Journal of Chemistry |
Year of publication | 2019 |
Journal volume | 43 |
Journal issue | 38 |
Pages of publication | 15413 |
a | 14.6528 ± 0.0005 Å |
b | 9.1347 ± 0.0003 Å |
c | 17.8598 ± 0.0006 Å |
α | 90° |
β | 108.073 ± 0.004° |
γ | 90° |
Cell volume | 2272.57 ± 0.14 Å3 |
Cell temperature | 293 ± 2 K |
Ambient diffraction temperature | 293 ± 2 K |
Number of distinct elements | 5 |
Space group number | 7 |
Hermann-Mauguin space group symbol | P 1 c 1 |
Hall space group symbol | P -2yc |
Residual factor for all reflections | 0.0659 |
Residual factor for significantly intense reflections | 0.0519 |
Weighted residual factors for significantly intense reflections | 0.1213 |
Weighted residual factors for all reflections included in the refinement | 0.133 |
Goodness-of-fit parameter for all reflections included in the refinement | 1.051 |
Diffraction radiation wavelength | 0.71073 Å |
Diffraction radiation type | MoKα |