Information card for entry 7058810
Formula |
C17 H10 F6 O2 S2 |
Calculated formula |
C17 H10 F6 O2 S2 |
Title of publication |
Diarylethene-based conjugated polymer networks for ultrafast photochromic films |
Authors of publication |
Fu, Qiu-Ting; Yan, Xiaodong; Li, Tao; Zhang, Xin-Yue; He, Yue; Zhang, Wen-Da; Liu, Yong; Li, Yunxing; Gu, Zhi-Guo |
Journal of publication |
New Journal of Chemistry |
Year of publication |
2019 |
Journal volume |
43 |
Journal issue |
39 |
Pages of publication |
15797 |
a |
12.065 ± 0.003 Å |
b |
8.649 ± 0.002 Å |
c |
16.45 ± 0.004 Å |
α |
90° |
β |
90° |
γ |
90° |
Cell volume |
1716.6 ± 0.7 Å3 |
Cell temperature |
153 ± 2 K |
Ambient diffraction temperature |
153 ± 2 K |
Number of distinct elements |
5 |
Space group number |
60 |
Hermann-Mauguin space group symbol |
P b c n |
Hall space group symbol |
-P 2n 2ab |
Residual factor for all reflections |
0.062 |
Residual factor for significantly intense reflections |
0.0352 |
Weighted residual factors for significantly intense reflections |
0.072 |
Weighted residual factors for all reflections included in the refinement |
0.0823 |
Goodness-of-fit parameter for all reflections included in the refinement |
1.034 |
Diffraction radiation wavelength |
0.71073 Å |
Diffraction radiation type |
MoKα |
Yes |
Yes |
No |