Information card for entry 7058823
Chemical name | potassium 5,6-dicyano-1,2,5-selenadiazolo[3,4-b]pyrazinidile, complex with 18-crown-6 |
Formula | C18 H24 K N6 O6 Se |
Calculated formula | C18 H24 K N6 O6 Se |
Title of publication | Design, synthesis and isolation of a new 1,2,5-selenadiazolidyl and structural and magnetic characterization of its alkali-metal salts |
Authors of publication | Semenov, Nikolay A.; Radiush, Ekaterina A.; Chulanova, Elena A.; Slawin, Alexandra M. Z.; Woollins, J. Derek; Kadilenko, Evgeny M.; Bagryanskaya, Irina Yu.; Irtegova, Irina G.; Bogomyakov, Artem S.; Shundrin, Leonid A.; Gritsan, Nina P.; Zibarev, Andrey V. |
Journal of publication | New Journal of Chemistry |
Year of publication | 2019 |
Journal volume | 43 |
Journal issue | 41 |
Pages of publication | 16331 |
a | 12.0108 ± 0.0005 Å |
b | 19.0336 ± 0.0008 Å |
c | 10.8353 ± 0.0004 Å |
α | 90° |
β | 105.018 ± 0.002° |
γ | 90° |
Cell volume | 2392.44 ± 0.17 Å3 |
Cell temperature | 296 ± 2 K |
Ambient diffraction temperature | 296 ± 2 K |
Number of distinct elements | 6 |
Space group number | 14 |
Hermann-Mauguin space group symbol | P 1 21/c 1 |
Hall space group symbol | -P 2ybc |
Residual factor for all reflections | 0.0917 |
Residual factor for significantly intense reflections | 0.0466 |
Weighted residual factors for significantly intense reflections | 0.1053 |
Weighted residual factors for all reflections included in the refinement | 0.1262 |
Goodness-of-fit parameter for all reflections included in the refinement | 1.012 |
Diffraction radiation wavelength | 0.71073 Å |
Diffraction radiation type | MoKα |