Information card for entry 7058826
Formula | C320 H448 Cd Eu2 N32 S32 |
Calculated formula | C320 H448 Cd Eu2 N32 S32 |
Title of publication | A sandwich-type tetrakis(phthalocyaninato) europium‒cadmium quadruple-decker complex: structural, spectroscopic, OFET, and gas sensing properties |
Authors of publication | Lu, Guang; Kong, Xia; Wang, Hailong; Chen, Yuxiang; Wei, Chuangyu; Chen, Yanli; Jiang, Jianzhuang |
Journal of publication | New Journal of Chemistry |
Year of publication | 2019 |
Journal volume | 43 |
Journal issue | 39 |
Pages of publication | 15763 |
a | 24.1643 ± 0.001 Å |
b | 25.1915 ± 0.0011 Å |
c | 29.7014 ± 0.0012 Å |
α | 83.172 ± 0.004° |
β | 71.695 ± 0.004° |
γ | 71.698 ± 0.004° |
Cell volume | 16292.9 ± 1.3 Å3 |
Cell temperature | 173 ± 0.1 K |
Ambient diffraction temperature | 173 ± 0.1 K |
Number of distinct elements | 6 |
Space group number | 2 |
Hermann-Mauguin space group symbol | P -1 |
Hall space group symbol | -P 1 |
Residual factor for all reflections | 0.1612 |
Residual factor for significantly intense reflections | 0.0885 |
Weighted residual factors for significantly intense reflections | 0.217 |
Weighted residual factors for all reflections included in the refinement | 0.2585 |
Goodness-of-fit parameter for all reflections included in the refinement | 0.986 |
Diffraction radiation wavelength | 1.54178 Å |
Diffraction radiation type | CuKα |