Information card for entry 7058859
Formula | C25 H18 Co N6 O3 |
Calculated formula | C25 H18 Co N6 O3 |
Title of publication | Antibacterial and aqueous dual-responsive sensing activities of monomeric complexes with uncoordinated imidazole sites |
Authors of publication | Liang, Lili; Miao, Maomao; Liu, Congsen; Zong, Zhihui; Zhang, Jun; Fang, Qiang |
Journal of publication | New Journal of Chemistry |
Year of publication | 2019 |
Journal volume | 43 |
Journal issue | 42 |
Pages of publication | 16691 |
a | 7.1558 ± 0.0008 Å |
b | 11.4155 ± 0.0013 Å |
c | 13.8516 ± 0.0015 Å |
α | 70.245 ± 0.002° |
β | 81.521 ± 0.002° |
γ | 82.789 ± 0.002° |
Cell volume | 1049.8 ± 0.2 Å3 |
Cell temperature | 296 ± 2 K |
Ambient diffraction temperature | 296.15 K |
Number of distinct elements | 5 |
Space group number | 2 |
Hermann-Mauguin space group symbol | P -1 |
Hall space group symbol | -P 1 |
Residual factor for all reflections | 0.0881 |
Residual factor for significantly intense reflections | 0.0541 |
Weighted residual factors for significantly intense reflections | 0.1204 |
Weighted residual factors for all reflections included in the refinement | 0.1402 |
Goodness-of-fit parameter for all reflections included in the refinement | 0.974 |
Diffraction radiation wavelength | 0.71073 Å |
Diffraction radiation type | MoKα |