Information card for entry 7058864
Formula | C48 H54 Bi N9 S6 |
Calculated formula | C48 H54 Bi N9 S6 |
Title of publication | Impact of substituents on the crystal structures and anti-leishmanial activity of new homoleptic Bi(iii) dithiocarbamates |
Authors of publication | Anamika, Anamika; Singh, Rajan; Manar, Krishna K.; Yadav, Chote Lal; Kumar, Akhilesh; Singh, Rakesh K.; Drew, Michael. G. B.; Singh, Nanhai |
Journal of publication | New Journal of Chemistry |
Year of publication | 2019 |
Journal volume | 43 |
Journal issue | 43 |
Pages of publication | 16921 |
a | 11.3316 ± 0.0009 Å |
b | 15.2459 ± 0.0015 Å |
c | 16.1179 ± 0.0014 Å |
α | 101.351 ± 0.008° |
β | 103.308 ± 0.008° |
γ | 104.784 ± 0.008° |
Cell volume | 2521.6 ± 0.4 Å3 |
Cell temperature | 293 ± 2 K |
Ambient diffraction temperature | 293 ± 2 K |
Number of distinct elements | 5 |
Space group number | 2 |
Hermann-Mauguin space group symbol | P -1 |
Hall space group symbol | -P 1 |
Residual factor for all reflections | 0.1715 |
Residual factor for significantly intense reflections | 0.0729 |
Weighted residual factors for significantly intense reflections | 0.1619 |
Weighted residual factors for all reflections included in the refinement | 0.2323 |
Goodness-of-fit parameter for all reflections included in the refinement | 0.909 |
Diffraction radiation wavelength | 0.71073 Å |
Diffraction radiation type | MoKα |