Information card for entry 7058878
Common name | Cl-F6BsubPc |
Formula | C24 H6 B Cl F6 N6 |
Calculated formula | C24 H6 B Cl F6 N6 |
Title of publication | Fluorinated boron subphthalocyanines: Lewis acid based templating chemistry facilitates random halide exchange, and fluoride versus chloride affects the basic photophysical properties and the solid-state arrangement |
Authors of publication | Bukuroshi, Esmeralda; Vestfrid, Jenya; Gross, Zeev; Bender, Timothy P. |
Journal of publication | New Journal of Chemistry |
Year of publication | 2019 |
Journal volume | 43 |
Journal issue | 42 |
Pages of publication | 16730 |
a | 13.4684 ± 0.0005 Å |
b | 13.4295 ± 0.0005 Å |
c | 23.0284 ± 0.0008 Å |
α | 90° |
β | 90° |
γ | 90° |
Cell volume | 4165.2 ± 0.3 Å3 |
Cell temperature | 147 ± 2 K |
Ambient diffraction temperature | 147 ± 2 K |
Number of distinct elements | 6 |
Space group number | 61 |
Hermann-Mauguin space group symbol | P b c a |
Hall space group symbol | -P 2ac 2ab |
Residual factor for all reflections | 0.0337 |
Residual factor for significantly intense reflections | 0.0312 |
Weighted residual factors for significantly intense reflections | 0.0831 |
Weighted residual factors for all reflections included in the refinement | 0.0856 |
Goodness-of-fit parameter for all reflections included in the refinement | 1.038 |
Diffraction radiation wavelength | 1.54178 Å |
Diffraction radiation type | CuKα |